(bindings) [2616ms] Running Header generator... [OK]
Done, (bindings) 2891ms, 18 warnings (475 known issues)
[ 2%] Automatic MOC for target pysideqwt
[ 2%] Built target pysideqwt_autogen
CMakeFiles\pysideqwt.dir\build.make:218: warning: overriding recipe for target 'pysideqwt/qwtplotcanvas_wrapper.cpp'
CMakeFiles\pysideqwt.dir\build.make:119: warning: ignoring old recipe for target 'pysideqwt/qwtplotcanvas_wrapper.cpp'
Scanning dependencies of target pysideqwt
CMakeFiles\pysideqwt.dir\build.make:218: warning: overriding recipe for target 'pysideqwt/qwtplotcanvas_wrapper.cpp'
CMakeFiles\pysideqwt.dir\build.make:119: warning: ignoring old recipe for target 'pysideqwt/qwtplotcanvas_wrapper.cpp'
[ 4%] Building CXX object CMakeFiles/pysideqwt.dir/pysideqwt_autogen/mocs_compilation.cpp.obj
[ 5%] Building CXX object CMakeFiles/pysideqwt.dir/pysideqwt/pysideqwt_module_wrapper.cpp.obj
In file included from E:/test/pysideqwt/venv/lib/site-packages/shiboken2_generator/include/sbkpython.h:100:0,
from E:\test\pysideqwt\build\pysideqwt\pysideqwt_module_wrapper.cpp:2:
E:/test/pysideqwt/venv/lib/site-packages/shiboken2_generator/include/shibokenmacros.h:60:0: warning: "SBK_DEPRECATED" redefined
#define SBK_DEPRECATED(func) func
^
E:/test/pysideqwt/venv/lib/site-packages/shiboken2_generator/include/shibokenmacros.h:52:0: note: this is the location of the previous definition
#define SBK_DEPRECATED(func) __declspec(deprecated) func
^
In file included from C:/Qt/Qt5.14.0/5.14.0/mingw73_64/include/QtGui/qpixmap.h:45:0,
from C:/Qt/Qt5.14.0/5.14.0/mingw73_64/include/QtGui/qicon.h:46,
from C:/Qt/Qt5.14.0/5.14.0/mingw73_64/include/QtGui/qwindow.h:55,
from C:/Qt/Qt5.14.0/5.14.0/mingw73_64/include/QtGui/QWindow:1,
from C:/Qt/Qt5.14.0/5.14.0/mingw73_64/include/QtGui/qpaintdevicewindow.h:44,
from C:/Qt/Qt5.14.0/5.14.0/mingw73_64/include/QtGui/QPaintDeviceWindow:1,
from C:/Qt/Qt5.14.0/5.14.0/mingw73_64/include/QtGui/qrasterwindow.h:44,
from E:/test/pysideqwt/venv/lib/site-packages/PySide2/include/QtGui/pyside2_qtgui_python.h:53,
from E:/test/pysideqwt/venv/lib/site-packages/PySide2/include/QtWidgets/pyside2_qtwidgets_python.h:47,
from E:\test\pysideqwt\build\pysideqwt\pysideqwt_python.h:9,
from E:\test\pysideqwt\build\pysideqwt\pysideqwt_module_wrapper.cpp:12:
C:/Qt/Qt5.14.0/5.14.0/mingw73_64/include/QtGui/qcolor.h: In constructor 'constexpr QColor::QColor(int, int, int, int)':
C:/Qt/Qt5.14.0/5.14.0/mingw73_64/include/QtGui/qcolor.h:79:18: sorry, unimplemented: use of the value of the object being constructed in a constant expression
0) {}
^
In file included from E:\test\pysideqwt\build\pysideqwt\pysideqwt_python.h:16:0,
from E:\test\pysideqwt\build\pysideqwt\pysideqwt_module_wrapper.cpp:12:
C:/Qwt-6.2.0-svn/include/qwt_spline_polynomial.h: At global scope:
C:/Qwt-6.2.0-svn/include/qwt_spline_polynomial.h:161:28: warning: 'static QwtSplinePolynomial QwtSplinePolynomial::fromSlopes(double, double, double, double)' redeclared without dllimport attribute af
ter being referenced with dll linkage
inline QwtSplinePolynomial QwtSplinePolynomial::fromSlopes(
^
C:/Qwt-6.2.0-svn/include/qwt_spline_polynomial.h:199:28: warning: 'static QwtSplinePolynomial QwtSplinePolynomial::fromCurvatures(double, double, double, double)' redeclared without dllimport attribut
e after being referenced with dll linkage
inline QwtSplinePolynomial QwtSplinePolynomial::fromCurvatures(
^
mingw32-make[2]: *** [CMakeFiles\pysideqwt.dir\build.make:286: CMakeFiles/pysideqwt.dir/pysideqwt/pysideqwt_module_wrapper.cpp.obj] Error 1
mingw32-make[1]: *** [CMakeFiles\Makefile2:100: CMakeFiles/pysideqwt.dir/all] Error 2
mingw32-make: *** [Makefile:149: all] Error 2